-compile: [javac] Compiling 4 source files to C:\project\cocos2dx\RECTSPLAY\proj.andro id\bin\classes [javac] warning: [options] source value 1.5 is obsolete and will be removed in a future release [javac] warning: [options] target value 1.5 is obsolete and will be removed in a future release [javac] warning: [options] To suppress warnings about obsolete options, use -Xlint:-options. [javac] C:\project\cocos2dx\RECTSPLAY\proj.android\src\org\cocos2dx\cpp\AppA ctivity.java:48: error: cannot find symbol [javac] import com.google.android.gms.ads.AdRequest; [javac] ^ [javac] symbol: class AdRequest [javac] location: package com.google.android.gms.ads [javac] C:\project\cocos2dx\RECTSPLAY\proj.android\src\org\cocos2dx\cpp\AppA ctivity.java:49: error: cannot find symbol [javac] import com.google.android.gms.ads.AdSize; [javac] ^ [javac] symbol: class AdSize [javac] location: package com.google.android.gms.ads [javac] C:\project\cocos2dx\RECTSPLAY\proj.android\src\org\cocos2dx\cpp\AppA ctivity.java:50: error: cannot find symbol [javac] import com.google.android.gms.ads.AdView; [javac] ^ [javac] symbol: class AdView [javac] location: package com.google.android.gms.ads [javac] C:\project\cocos2dx\RECTSPLAY\proj.android\src\org\cocos2dx\cpp\AppA ctivity.java:60: error: cannot find symbol [javac] private AdView adView; [javac] ^ [javac] symbol: class AdView [javac] location: class AppActivity [javac] C:\project\cocos2dx\RECTSPLAY\proj.android\src\org\cocos2dx\cpp\AppA ctivity.java:120: error: cannot find symbol [javac] adView = new AdView(this); [javac] ^ [javac] symbol: class AdView [javac] location: class AppActivity [javac] C:\project\cocos2dx\RECTSPLAY\proj.android\src\org\cocos2dx\cpp\AppA ctivity.java:121: error: cannot find symbol [javac] adView.setAdSize(AdSize.BANNER); [javac] ^ [javac] symbol: variable AdSize [javac] location: class AppActivity [javac] C:\project\cocos2dx\RECTSPLAY\proj.android\src\org\cocos2dx\cpp\AppA ctivity.java:125: error: cannot find symbol [javac] AdRequest adRequest = new AdRequest.Builder() [javac] ^ [javac] symbol: class AdRequest [javac] location: class AppActivity [javac] C:\project\cocos2dx\RECTSPLAY\proj.android\src\org\cocos2dx\cpp\AppA ctivity.java:126: error: cannot find symbol [javac] .addTestDevice(AdRequest.DEVICE_ID_EMULATOR) [javac] ^ [javac] symbol: variable AdRequest [javac] location: class AppActivity [javac] C:\project\cocos2dx\RECTSPLAY\proj.android\src\org\cocos2dx\cpp\AppA ctivity.java:125: error: package AdRequest does not exist [javac] AdRequest adRequest = new AdRequest.Builder() [javac] ^ [javac] 9 errors [javac] 3 warnings
BUILD FAILED D:\Android\sdk\tools\ant\build.xml:716: The following error occurred while execu ting this line: D:\Android\sdk\tools\ant\build.xml:730: Compile failed; see the compiler error o utput for details.
Total time: 5 seconds Error running command, return code: 1.
I try to add admob src on my C++ android app.(Window 8.1)
so I did many things (put in lib folder, Checking All at [ Java Build Path - Order and Export ] … etc)
but not working.
I’m using Android 4.2.2 and Latest version of google-play-services on SDK Manager.
I added latest version of google-play-services-gms-ads-lite (9.2.1) on my project. and libcocos2dx.
how can I fix this?